Target
Fatty acid-binding protein, adipocyte
Ligand
BDBM312500
Substrate
Meas. Tech.
Time Resolved-Fluorescence Energy Transfer (TR-FRET) Assay
IC50
17.0±n/a nM
Citation
 Buettelmann, BCeccarelli, SMKuehne, HKuhn, BNeidhart, WObst Sander, URichter, H Bicyclic thiophenylamide compounds US Patent  US9604977 Publication Date 3/28/2017 
Target
Name:
Fatty acid-binding protein, adipocyte
Synonyms:
A-FABP ALBP FABP4 Fatty acid binding protein adipocyte Fatty acid-binding protein 4 (FABP4)
Type:
Enzyme
Mol. Mass.:
14719.23
Organism:
Homo sapiens (Human)
Description:
P15090
Residue:
132
  
Inhibitor
Name:
BDBM312500
Synonyms:
4-[3-(3-Cyclopropyl-[1,2,4]oxadiazol-5-yl)-4,5,6,7-tetrahydro-benzo[b]thiophen-2-ylcarbamoyl]-5,6-dihydro-2H-pyran-3-carboxylic acid | US9604977, Example 246
Type:
Small organic molecule
Emp. Form.:
C20H21N3O5S
Mol. Mass.:
415.463
SMILES:
OC(=O)C1=C(CCOC1)C(=O)Nc1sc2CCCCc2c1-c1nc(no1)C1CC1
: