Target
Prostaglandin E2 receptor EP2 subtype
Ligand
BDBM180027
Substrate
Meas. Tech.
Binding Assay
pH
6±n/a
Ki
>10.00±n/a nM
Comments
extracted
Citation
 Shibakawa, NYoneda, KKatsube, TKanda, TIto, KYamamoto, KIwase, NUshiyama, S Substituted biaryl compound US Patent  US9676720 Publication Date 6/13/2017 
Target
Name:
Prostaglandin E2 receptor EP2 subtype
Synonyms:
PE2R2_HUMAN PTGER2 Prostaglandin E2 receptor Prostanoid EP2 Receptor
Type:
Enzyme
Mol. Mass.:
39775.71
Organism:
Homo sapiens (Human)
Description:
P43116
Residue:
358
  
Inhibitor
Name:
BDBM180027
Synonyms:
US9676720, Comparative example 14
Type:
Small organic molecule
Emp. Form.:
C28H28N4O5S
Mol. Mass.:
532.611
SMILES:
CCOc1ccc(cc1)-c1ccc(CN(Cc2cccc(NCC(O)=O)n2)S(=O)(=O)c2ccccn2)cc1
: