Target
P2X purinoceptor 7
Ligand
BDBM173411
Substrate
Meas. Tech.
Ca2+ flux Assay
Ki
3.50±n/a nM
Citation
 Alcazar Vaca, MJAndres Gil, JILetavic, MARudolph, DAShireman, BTStenne, BMZiff, JM P2X7 modulators US Patent  US9604982 Publication Date 3/28/2017 
Target
Name:
P2X purinoceptor 7
Synonyms:
ATP receptor P2X purinoceptor 7 P2X purinoceptor 7 (P2X7) P2X7 rat P2rx7 | Purinergic receptor
Type:
Protein
Mol. Mass.:
68403.50
Organism:
Rattus norvegicus (Rat)
Description:
Q64663
Residue:
595
  
Inhibitor
Name:
BDBM173411
Synonyms:
US10323032, Example 124 US9604982, Example 124
Type:
Small organic molecule
Emp. Form.:
C22H20ClF4N5O
Mol. Mass.:
481.874
SMILES:
C[C@@H]1Cc2c(CN1C(=O)c1cccc(c1Cl)C(F)(F)F)nc(C)nc2-c1ccn(CCF)n1
: