Target
P2X purinoceptor 7
Ligand
BDBM173268
Substrate
Meas. Tech.
Ca2+ flux Assay
Ki
3.50±n/a nM
Citation
 Alcazar Vaca, MJAndres Gil, JILetavic, MARudolph, DAShireman, BTStenne, BMZiff, JM P2X7 modulators US Patent  US9604982 Publication Date 3/28/2017 
Target
Name:
P2X purinoceptor 7
Synonyms:
ATP receptor P2X purinoceptor 7 P2X purinoceptor 7 (P2X7) P2X7 rat P2rx7 | Purinergic receptor
Type:
Protein
Mol. Mass.:
68403.50
Organism:
Rattus norvegicus (Rat)
Description:
Q64663
Residue:
595
  
Inhibitor
Name:
BDBM173268
Synonyms:
US10323032, Example 20 US9604982, Example 20
Type:
Small organic molecule
Emp. Form.:
C17H12Cl2FN5O
Mol. Mass.:
392.214
SMILES:
Fc1c(Cl)ccc(C(=O)N2CCc3c(C2)ncnc3-c2ccn[nH]2)c1Cl
: