Target
P2X purinoceptor 7
Ligand
BDBM173272
Substrate
Meas. Tech.
Ca2+ flux Assay
Ki
7.90±n/a nM
Citation
 Alcazar Vaca, MJAndres Gil, JILetavic, MARudolph, DAShireman, BTStenne, BMZiff, JM P2X7 modulators US Patent  US9604982 Publication Date 3/28/2017 
Target
Name:
P2X purinoceptor 7
Synonyms:
ATP receptor P2X purinoceptor 7 P2X purinoceptor 7 (P2X7) P2X7 rat P2rx7 | Purinergic receptor
Type:
Protein
Mol. Mass.:
68403.50
Organism:
Rattus norvegicus (Rat)
Description:
Q64663
Residue:
595
  
Inhibitor
Name:
BDBM173272
Synonyms:
US10323032, Example 108 US9096596, 24 | US9604982, Example 108
Type:
Small organic molecule
Emp. Form.:
C17H12ClF3N6O
Mol. Mass.:
408.765
SMILES:
FC(F)(F)c1cccc(C(=O)N2CCc3c(C2)ncnc3-n2nccn2)c1Cl
: