Target
Cyclin-dependent kinase 2/G1/S-specific cyclin-E1
Ligand
BDBM10091
Substrate
Histidine-tagged Rb
Meas. Tech.
CDK2/Cyclin E Enzyme Assay
pH
7.5±n/a
Temperature
295.15±n/a K
IC50
3±n/a nM
Comments
Value at assay detection limit.
Citation
 Dermatakis, ALuk, KCDePinto, W Synthesis of potent oxindole CDK2 inhibitors. Bioorg Med Chem 11:1873-81 (2003)  
Target
Name:
Cyclin-dependent kinase 2/G1/S-specific cyclin-E1
Synonyms:
CDK2/CycE CDK2/E Cyclin-Dependent Kinase 2 (CDK2) Cyclin-dependent kinase 2/cyclin E1
Type:
Protein
Mol. Mass.:
Description:
Components:
This complex has 2 components.
Component 1
Name:
Cyclin-dependent kinase 2
Synonyms:
CDK2 CDK2_HUMAN Cell division protein kinase 2 Protein cereblon/Cyclin-dependent kinase 2 | p33 protein kinase
Type:
Enzyme Subunit
Mol. Mass.:
33938.17
Organism:
Homo sapiens (Human)
Description:
P24941
Residue:
298
  
Component 2
Name:
G1/S-specific cyclin-E1
Synonyms:
CCNE CCNE1_HUMAN
Type:
Enzyme Subunit
Mol. Mass.:
47073.17
Organism:
Homo sapiens (Human)
Description:
Residue:
410
  
Inhibitor
Name:
BDBM10091
Synonyms:
(-)-(R)-(Z)-4-(3-Amino-pyrrolidinyl)-3-(3-methoxy-1H-pyrrol-2-ylmethylene) -5- nitro -1,3-dihydro-indol-2-one C-4 substituted oxindole inhibitor 7o
Type:
Small organic molecule
Emp. Form.:
C18H19N5O4
Mol. Mass.:
369.3746
SMILES:
COc1cc[nH]c1\C=C1/C(=O)Nc2ccc(c(N3CC[C@@H](N)C3)c12)N(=O)=O
:
Substrate
Name:
Retinoblastoma-associated protein
Synonyms:
RB1 Rb pp110 | retinoblastoma
Type:
Other Protein Type
Mol. Mass.:
106170.80
Organism:
Homo sapiens (Human)
Description:
P06400
Residue:
928