Target
Cyclin-dependent kinase 2/G1/S-specific cyclin-E1
Ligand
BDBM10127
Substrate
Histidine-tagged Rb
Meas. Tech.
CDK2/Cyclin E Enzyme Assay
pH
7.5±n/a
Temperature
295.15±n/a K
IC50
5500±n/a nM
Citation
 Liu, JJDermatakis, ALukacs, CKonzelmann, FChen, YKammlott, UDepinto, WYang, HYin, XChen, YSchutt, ASimcox, MELuk, KC 3,5,6-Trisubstituted naphthostyrils as CDK2 inhibitors. Bioorg Med Chem Lett 13:2465-8 (2003)  
Target
Name:
Cyclin-dependent kinase 2/G1/S-specific cyclin-E1
Synonyms:
CDK2/CycE CDK2/E Cyclin-Dependent Kinase 2 (CDK2) Cyclin-dependent kinase 2/cyclin E1
Type:
Protein
Mol. Mass.:
Description:
Components:
This complex has 2 components.
Component 1
Name:
Cyclin-dependent kinase 2
Synonyms:
CDK2 CDK2_HUMAN Cell division protein kinase 2 Protein cereblon/Cyclin-dependent kinase 2 | p33 protein kinase
Type:
Enzyme Subunit
Mol. Mass.:
33938.17
Organism:
Homo sapiens (Human)
Description:
P24941
Residue:
298
  
Component 2
Name:
G1/S-specific cyclin-E1
Synonyms:
CCNE CCNE1_HUMAN
Type:
Enzyme Subunit
Mol. Mass.:
47073.17
Organism:
Homo sapiens (Human)
Description:
Residue:
410
  
Inhibitor
Name:
BDBM10127
Synonyms:
tert-butyl N-(2-{[9-fluoro-3-oxo-5-(1H-pyrrol-2-yl)-2-azatricyclo[6.3.1.0^{4,12}]dodeca-1(11),4,6,8(12),9-pentaen-7-yl]amino}ethyl)carbamate | trisubstituted naphthostyril analogue 7g
Type:
Small organic molecule
Emp. Form.:
C22H23FN4O3
Mol. Mass.:
410.4414
SMILES:
CC(C)(C)OC(=O)NCCNc1cc(-c2ccc[nH]2)c2C(=O)Nc3ccc(F)c1c23
:
Substrate
Name:
Retinoblastoma-associated protein
Synonyms:
RB1 Rb pp110 | retinoblastoma
Type:
Other Protein Type
Mol. Mass.:
106170.80
Organism:
Homo sapiens (Human)
Description:
P06400
Residue:
928