Target
Tyrosine-protein kinase JAK1
Ligand
BDBM232664
Substrate
Meas. Tech.
JAK Enzyme Assay
Ki
0.160±n/a nM
Citation
 Zak, MERay, NCGoodacre, SCMendonca, RKellar, TCheng, YLi, WYuen, P 5-chloro-2-difluoromethoxyphenyl pyrazolopyrimidine compounds, compositions and methods of use thereof US Patent  US9604984 Publication Date 3/28/2017 
Target
Name:
Tyrosine-protein kinase JAK1
Synonyms:
JAK-1 JAK1A JAK1_HUMAN Janus kinase 1 (JAK1) | Janus kinase 1 JAK1
Type:
Protein
Mol. Mass.:
133293.73
Organism:
Homo sapiens (Human)
Description:
P23458
Residue:
1154
  
Inhibitor
Name:
BDBM232664
Synonyms:
US9346815, 210 | US9604984, Example 210
Type:
Small organic molecule
Emp. Form.:
C25H23ClF2N6O2S
Mol. Mass.:
545.004
SMILES:
CCCCN(C)CC#Cc1nc(c(NC(=O)c2cnn3cccnc23)s1)-c1cc(Cl)ccc1OC(F)F
: