Target
Tyrosine-protein kinase JAK2
Ligand
BDBM232752
Substrate
Meas. Tech.
JAK Enzyme Assay
Ki
0.180±n/a nM
Citation
 Zak, MERay, NCGoodacre, SCMendonca, RKellar, TCheng, YLi, WYuen, P 5-chloro-2-difluoromethoxyphenyl pyrazolopyrimidine compounds, compositions and methods of use thereof US Patent  US9604984 Publication Date 3/28/2017 
Target
Name:
Tyrosine-protein kinase JAK2
Synonyms:
JAK-2 JAK2_HUMAN Janus kinase 2 (JAK2) | Janus kinase 2 (a protein tyrosine kinase)
Type:
Protein
Mol. Mass.:
130684.68
Organism:
Homo sapiens (Human)
Description:
O60674
Residue:
1132
  
Inhibitor
Name:
BDBM232752
Synonyms:
US9346815, 298 | US9604984, Example 298
Type:
Small organic molecule
Emp. Form.:
C22H21ClF2N8O2
Mol. Mass.:
502.904
SMILES:
CN[C@H]1C[C@H](C1)n1cc(NC(=O)c2c(N)nn3cccnc23)c(n1)-c1cc(Cl)ccc1OC(F)F
: