Target
Dimer of Gag-Pol polyprotein [501-599]
Ligand
BDBM10153
Substrate
Fluorogenic Peptide Substrate
Meas. Tech.
Protease Inhibition Assay
Ki
0.56±n/a nM
IC50
0.5±n/a nM
Citation
 Stranix, BRLavallee, JFSevigny, GYelle, JPerron, VLeBerre, NHerbart, DWu, JJ Lysine sulfonamides as novel HIV-protease inhibitors: Nepsilon-acyl aromatic alpha-amino acids. Bioorg Med Chem Lett 16:3459-62 (2006)  
Target
Name:
Dimer of Gag-Pol polyprotein [501-599]
Synonyms:
HIV-1 Protease | HIV-1 Protease, recombinant, isolate HXB2
Type:
Protein Complex
Mol. Mass.:
Description:
Components:
This complex has 2 components.
Component 1
Name:
Gag-Pol polyprotein [501-599]
Synonyms:
BRU isolated HIV-1 Protease B Subtype Chain B LAI(Wild type) Protease Retropepsin | gag-pol
Type:
Enzyme Subunit
Mol. Mass.:
10795.19
Organism:
Human immunodeficiency virus type 1
Description:
P03367[501-599]
Residue:
99
  
Component 2
Name:
Gag-Pol polyprotein [501-599]
Synonyms:
BRU isolated HIV-1 Protease B Subtype Chain B LAI(Wild type) Protease Retropepsin | gag-pol
Type:
Enzyme Subunit
Mol. Mass.:
10795.19
Organism:
Human immunodeficiency virus type 1
Description:
P03367[501-599]
Residue:
99
  
Inhibitor
Name:
BDBM10153
Synonyms:
(2S)-2-amino-N-[(5R)-5-[(4-aminobenzene)(2-methylpropyl)sulfonamido]-6-hydroxyhexyl]-3,3-diphenylpropanamide | lysine sulfonamide analogue 14
Type:
Small organic molecule
Emp. Form.:
C31H42N4O4S
Mol. Mass.:
566.755
SMILES:
CC(C)CN(C(CO)CCCCNC(=O)[C@@H](N)C(c1ccccc1)c1ccccc1)S(=O)(=O)c1ccc(N)cc1
:
Substrate
Name:
Fluorogenic Peptide Substrate
Synonyms:
Type:
Peptide
Mol. Mass.:
4156.59
Organism:
Description:
Residue:
39