Target
RAC-alpha serine/threonine-protein kinase
Ligand
BDBM312526
Substrate
Meas. Tech.
Kinase Assay
IC50
9.80±n/a nM
Citation
 Bärfacker, LScott, WHägebarth, AInce, SRehwinkel, HPolitz, ONeuhaus, RBriem, HBömer, U Imidazopyridazines as Akt kinase inhibitors US Patent  US9604989 Publication Date 3/28/2017 
Target
Name:
RAC-alpha serine/threonine-protein kinase
Synonyms:
AKT phosphorylation (p-AKT) AKT1/PPP1CA C-AKT PKB alpha Protein kinase B Protein kinase B (Akt 1) Protein kinase B alpha Proto-oncogene Akt (Akt1) Proto-oncogene c-Akt (AKT1) RAC-PK-alpha RAC-alpha serine/threonine-protein kinase (AKT1) | RAC-alpha serine/threonine-protein kinase (pAKT)
Type:
Enzyme
Mol. Mass.:
55681.25
Organism:
Homo sapiens (Human)
Description:
P31749
Residue:
480
  
Inhibitor
Name:
BDBM312526
Synonyms:
US9604989, Example 14
Type:
Small organic molecule
Emp. Form.:
C28H25N5O
Mol. Mass.:
447.531
SMILES:
COc1cc(-c2cccnc2)c2nc(c(-c3ccccc3)n2n1)-c1ccc(cc1)C1(N)CCC1
: