Target
RAC-alpha serine/threonine-protein kinase
Ligand
BDBM312532
Substrate
Meas. Tech.
Kinase Assay
IC50
120±n/a nM
Citation
 Bärfacker, LScott, WHägebarth, AInce, SRehwinkel, HPolitz, ONeuhaus, RBriem, HBömer, U Imidazopyridazines as Akt kinase inhibitors US Patent  US9604989 Publication Date 3/28/2017 
Target
Name:
RAC-alpha serine/threonine-protein kinase
Synonyms:
AKT phosphorylation (p-AKT) AKT1/PPP1CA C-AKT PKB alpha Protein kinase B Protein kinase B (Akt 1) Protein kinase B alpha Proto-oncogene Akt (Akt1) Proto-oncogene c-Akt (AKT1) RAC-PK-alpha RAC-alpha serine/threonine-protein kinase (AKT1) | RAC-alpha serine/threonine-protein kinase (pAKT)
Type:
Enzyme
Mol. Mass.:
55681.25
Organism:
Homo sapiens (Human)
Description:
P31749
Residue:
480
  
Inhibitor
Name:
BDBM312532
Synonyms:
US9604989, Example 20
Type:
Small organic molecule
Emp. Form.:
C27H24N6
Mol. Mass.:
432.5197
SMILES:
NC1(CCC1)c1ccc(cc1)-c1nc2c(cc(C=C)nn2c1-c1ccccc1)-c1cc[nH]n1
: