Target
RAC-alpha serine/threonine-protein kinase
Ligand
BDBM312543
Substrate
Meas. Tech.
Kinase Assay
IC50
51.0±n/a nM
Citation
 Bärfacker, LScott, WHägebarth, AInce, SRehwinkel, HPolitz, ONeuhaus, RBriem, HBömer, U Imidazopyridazines as Akt kinase inhibitors US Patent  US9604989 Publication Date 3/28/2017 
Target
Name:
RAC-alpha serine/threonine-protein kinase
Synonyms:
AKT phosphorylation (p-AKT) AKT1/PPP1CA C-AKT PKB alpha Protein kinase B Protein kinase B (Akt 1) Protein kinase B alpha Proto-oncogene Akt (Akt1) Proto-oncogene c-Akt (AKT1) RAC-PK-alpha RAC-alpha serine/threonine-protein kinase (AKT1) | RAC-alpha serine/threonine-protein kinase (pAKT)
Type:
Enzyme
Mol. Mass.:
55681.25
Organism:
Homo sapiens (Human)
Description:
P31749
Residue:
480
  
Inhibitor
Name:
BDBM312543
Synonyms:
US9604989, Example 30
Type:
Small organic molecule
Emp. Form.:
C24H23ClN4O
Mol. Mass.:
418.919
SMILES:
CCOc1cc(Cl)nn2c(c(nc12)-c1ccc(cc1)C1(N)CCC1)-c1ccccc1
: