Target
RAC-beta serine/threonine-protein kinase
Ligand
BDBM312579
Substrate
Meas. Tech.
Kinase Assay
IC50
2.60±n/a nM
Citation
 Bärfacker, LScott, WHägebarth, AInce, SRehwinkel, HPolitz, ONeuhaus, RBriem, HBömer, U Imidazopyridazines as Akt kinase inhibitors US Patent  US9604989 Publication Date 3/28/2017 
Target
Name:
RAC-beta serine/threonine-protein kinase
Synonyms:
AKT2 PKB beta Protein kinase B (Akt 2) Protein kinase B, beta RAC-alpha serine/threonine-protein kinase (AKT2) RAC-beta serine/threonine-protein kinase (AKT2) Serine/threonine-protein kinase AKT2 | Serine/threonine-protein kinase Rac alpha/beta
Type:
Enzyme
Mol. Mass.:
55766.64
Organism:
Homo sapiens (Human)
Description:
Residue:
481
  
Inhibitor
Name:
BDBM312579
Synonyms:
US9604989, Example 65
Type:
Small organic molecule
Emp. Form.:
C27H25N7O
Mol. Mass.:
463.5337
SMILES:
CNC(=O)c1cc(-c2cc[nH]n2)c2nc(c(-c3ccccc3)n2n1)-c1ccc(cc1)C1(N)CCC1
: