Target
RAC-beta serine/threonine-protein kinase
Ligand
BDBM312580
Substrate
Meas. Tech.
Kinase Assay
IC50
180±n/a nM
Citation
 Bärfacker, LScott, WHägebarth, AInce, SRehwinkel, HPolitz, ONeuhaus, RBriem, HBömer, U Imidazopyridazines as Akt kinase inhibitors US Patent  US9604989 Publication Date 3/28/2017 
Target
Name:
RAC-beta serine/threonine-protein kinase
Synonyms:
AKT2 PKB beta Protein kinase B (Akt 2) Protein kinase B, beta RAC-alpha serine/threonine-protein kinase (AKT2) RAC-beta serine/threonine-protein kinase (AKT2) Serine/threonine-protein kinase AKT2 | Serine/threonine-protein kinase Rac alpha/beta
Type:
Enzyme
Mol. Mass.:
55766.64
Organism:
Homo sapiens (Human)
Description:
Residue:
481
  
Inhibitor
Name:
BDBM312580
Synonyms:
US9604989, Example 66
Type:
Small organic molecule
Emp. Form.:
C25H25N5O
Mol. Mass.:
411.4989
SMILES:
CCNC(=O)c1ccc2nc(c(-c3ccccc3)n2n1)-c1ccc(cc1)C1(N)CCC1
: