Target
RAC-alpha serine/threonine-protein kinase
Ligand
BDBM312592
Substrate
Meas. Tech.
Kinase Assay
IC50
32.0±n/a nM
Citation
 Bärfacker, LScott, WHägebarth, AInce, SRehwinkel, HPolitz, ONeuhaus, RBriem, HBömer, U Imidazopyridazines as Akt kinase inhibitors US Patent  US9604989 Publication Date 3/28/2017 
Target
Name:
RAC-alpha serine/threonine-protein kinase
Synonyms:
AKT phosphorylation (p-AKT) AKT1/PPP1CA C-AKT PKB alpha Protein kinase B Protein kinase B (Akt 1) Protein kinase B alpha Proto-oncogene Akt (Akt1) Proto-oncogene c-Akt (AKT1) RAC-PK-alpha RAC-alpha serine/threonine-protein kinase (AKT1) | RAC-alpha serine/threonine-protein kinase (pAKT)
Type:
Enzyme
Mol. Mass.:
55681.25
Organism:
Homo sapiens (Human)
Description:
P31749
Residue:
480
  
Inhibitor
Name:
BDBM312592
Synonyms:
1-[4-(6-Ethoxy-3-phenylimidazo[1,2-b]pyridazin-2-yl)phenyl]cyclobutanamine | US9604989, Example 78
Type:
Small organic molecule
Emp. Form.:
C24H24N4O
Mol. Mass.:
384.4736
SMILES:
CCOc1ccc2nc(c(-c3ccccc3)n2n1)-c1ccc(cc1)C1(N)CCC1
: