Target
ATP-sensitive inward rectifier potassium channel 1
Ligand
BDBM312600
Substrate
Meas. Tech.
Electrophysiology Assay
IC50
120±n/a nM
Citation
 Pasternak, ADeJesus, RKDing, FDong, SFrie, JLGu, XJiang, JShahripour, APio, BTang, HWalsh, S Inhibitors of the renal outer medullary potassium channel US Patent  US9604998 Publication Date 3/28/2017 
Target
Name:
ATP-sensitive inward rectifier potassium channel 1
Synonyms:
ATP-regulated potassium channel ROM-K ATP-sensitive inward rectifier potassium channel 1 KCNJ1 Potassium channel (ATP modulatory) ROMK1 The Renal Outer Medullary Potassium (ROMK)
Type:
Enzyme Catalytic Domain
Mol. Mass.:
44809.08
Organism:
Homo sapiens (Human)
Description:
gi_223460826
Residue:
391
  
Inhibitor
Name:
BDBM312600
Synonyms:
US9604998, Example 6
Type:
Small organic molecule
Emp. Form.:
C26H28FN3O4
Mol. Mass.:
465.5166
SMILES:
Cc1c2COC(=O)c2ccc1[C@@H](O)CN1CCN2C[C@@H](OC[C@@H]2C1)c1ccc(F)c(C#N)c1C
: