Target
ATP-sensitive inward rectifier potassium channel 1
Ligand
BDBM312686
Substrate
Meas. Tech.
Electrophysiology Assay
IC50
90.0±n/a nM
Citation
 Pasternak, ADeJesus, RKDing, FDong, SFrie, JLGu, XJiang, JShahripour, APio, BTang, HWalsh, S Inhibitors of the renal outer medullary potassium channel US Patent  US9604998 Publication Date 3/28/2017 
Target
Name:
ATP-sensitive inward rectifier potassium channel 1
Synonyms:
ATP-regulated potassium channel ROM-K ATP-sensitive inward rectifier potassium channel 1 KCNJ1 Potassium channel (ATP modulatory) ROMK1 The Renal Outer Medullary Potassium (ROMK)
Type:
Enzyme Catalytic Domain
Mol. Mass.:
44809.08
Organism:
Homo sapiens (Human)
Description:
gi_223460826
Residue:
391
  
Inhibitor
Name:
BDBM312686
Synonyms:
US9604998, Example 85
Type:
Small organic molecule
Emp. Form.:
C27H31N3O4
Mol. Mass.:
461.5527
SMILES:
COc1cc(CCN2CCN3C[C@H](OC[C@@H]3C2)c2ccc3C(=O)O[C@@H](C)Cc3c2)ccc1C#N
: