Target
Caspase-3
Ligand
BDBM10196
Substrate
Caspase-3 Fluorogenic Substrate
Meas. Tech.
Fluorometric Assay
pH
7.4±n/a
Temperature
295.15±n/a K
Ki
100±n/a nM
Citation
 Allen, DAPham, PChoong, ICFahr, BBurdett, MTLew, WDeLano, WLGordon, EMLam, JWO'Brien, TLee, D Identification of potent and novel small-molecule inhibitors of caspase-3. Bioorg Med Chem Lett 13:3651-5 (2003)  
Target
Name:
Caspase-3
Synonyms:
Apopain CASP3 CPP-32 Caspase 3 Caspase-3 subunit p17 SCA-1 Yama protein | caspase-3 preproprotein
Type:
Hydrolase; heterotetramer of two heterodimers
Mol. Mass.:
31607.55
Organism:
Homo sapiens (Human)
Description:
Residue:
277
  
Inhibitor
Name:
BDBM10196
Synonyms:
5-[(5-{[(2S)-1-carboxy-3-oxopropan-2-yl]carbamoyl}-5-(3-methylphenyl)pentyl)sulfamoyl]-2-hydroxybenzoic acid | sulfonamide analog 17
Type:
Small organic molecule
Emp. Form.:
C24H28N2O9S
Mol. Mass.:
520.552
SMILES:
Cc1cccc(c1)C(CCCCNS(=O)(=O)c1ccc(O)c(c1)C(O)=O)C(=O)N[C@@H](CC(O)=O)C=O
:
Substrate
Name:
Caspase-3 Fluorogenic Substrate
Synonyms:
Caspase-3 Fluorogenic Substrate Ac-Asp-Glu-Val-Asp-AFC | Fluorometric Tetrapeptide Ac-DEVD-AMC
Type:
Mol. Mass.:
1477.75
Organism:
Description:
AFC = 7-Amino-4-trifluoromethylcoumarin
Residue:
16
ACASPGLVALASPAFC