Target
Nicotinamide phosphoribosyltransferase
Ligand
BDBM180091
Substrate
Meas. Tech.
Biochemical Inhibition Assay
pH
7.5±n/a
Temperature
298.15±n/a K
IC50
2.60±n/a nM
Comments
extracted
Citation
 Bair, KWBuckmelter, AJHan, BLin, JReynolds, DJSmith, CCWang, ZZheng, X Compounds and compositions for the inhibition of NAMPT US Patent  US9676721 Publication Date 6/13/2017 
Target
Name:
Nicotinamide phosphoribosyltransferase
Synonyms:
NAMPT NAmPRTase Nicotinamide phosphoribosyltransferase (NAMPT) PBEF1 | Pre-B-cell colony-enhancing factor 1
Type:
Enzyme
Mol. Mass.:
55524.98
Organism:
Homo sapiens (Human)
Description:
P43490
Residue:
491
  
Inhibitor
Name:
BDBM180091
Synonyms:
US9676721, 3 1-({4-[(3-chloro-4-methoxybenzene)sulfonyl]phenyl}methyl)-2-cyano-3-(pyridin-4-yl)guanidine
Type:
Small organic molecule
Emp. Form.:
C21H18ClN5O3S
Mol. Mass.:
455.917
SMILES:
COc1ccc(cc1Cl)S(=O)(=O)c1ccc(CN\C(Nc2ccncc2)=N/C#N)cc1
: