Target
Nicotinamide phosphoribosyltransferase
Ligand
BDBM180920
Substrate
Meas. Tech.
Biochemical Inhibition Assay
pH
7.5±n/a
Temperature
298.15±n/a K
IC50
1.70±n/a nM
Comments
extracted
Citation
 Bair, KWBuckmelter, AJHan, BLin, JReynolds, DJSmith, CCWang, ZZheng, X Compounds and compositions for the inhibition of NAMPT US Patent  US9676721 Publication Date 6/13/2017 
Target
Name:
Nicotinamide phosphoribosyltransferase
Synonyms:
NAMPT NAmPRTase Nicotinamide phosphoribosyltransferase (NAMPT) PBEF1 | Pre-B-cell colony-enhancing factor 1
Type:
Enzyme
Mol. Mass.:
55524.98
Organism:
Homo sapiens (Human)
Description:
P43490
Residue:
491
  
Inhibitor
Name:
BDBM180920
Synonyms:
US9676721, 39 2-cyano-1-({4-[(3-fluoro-5-methylbenzene)sulfonyl]phenyl}methyl)-3-(pyridin-4-yl)guanidine
Type:
Small organic molecule
Emp. Form.:
C21H18FN5O2S
Mol. Mass.:
423.463
SMILES:
Cc1cc(F)cc(c1)S(=O)(=O)c1ccc(CN\C(Nc2ccncc2)=N/C#N)cc1
: