Target
Nicotinamide phosphoribosyltransferase
Ligand
BDBM180112
Substrate
Meas. Tech.
Biochemical Inhibition Assay
pH
7.5±n/a
Temperature
298.15±n/a K
IC50
18±n/a nM
Comments
extracted
Citation
 Bair, KWBuckmelter, AJHan, BLin, JReynolds, DJSmith, CCWang, ZZheng, X Compounds and compositions for the inhibition of NAMPT US Patent  US9676721 Publication Date 6/13/2017 
Target
Name:
Nicotinamide phosphoribosyltransferase
Synonyms:
NAMPT NAmPRTase Nicotinamide phosphoribosyltransferase (NAMPT) PBEF1 | Pre-B-cell colony-enhancing factor 1
Type:
Enzyme
Mol. Mass.:
55524.98
Organism:
Homo sapiens (Human)
Description:
P43490
Residue:
491
  
Inhibitor
Name:
BDBM180112
Synonyms:
US9676721, 103 3-[(4-{[2-cyano-3-(pyridin-4-yl)carbamimidamido]methyl}benzene)sulfonyl]-N,N-diethyl-4-fluorobenzamide
Type:
Small organic molecule
Emp. Form.:
C25H25FN6O3S
Mol. Mass.:
508.568
SMILES:
CCN(CC)C(=O)c1ccc(F)c(c1)S(=O)(=O)c1ccc(CNC(Nc2ccncc2)=NC#N)cc1
: