Target
Inhibitor of nuclear factor kappa-B kinase subunit beta
Ligand
BDBM312754
Substrate
Meas. Tech.
NIK Enzyme Inhibition Assay
Ki
1.60±n/a nM
Citation
 Blaquiere, NCastanedo, GFeng, JAHu, BStaben, SYuen, PWu, GBurch, J Alkynyl alcohols and methods of use US Patent  US9605005 Publication Date 3/28/2017 
Target
Name:
Inhibitor of nuclear factor kappa-B kinase subunit beta
Synonyms:
I-kappa-B Kinase 2 (IKK-beta) I-kappa-B-kinase beta IKBKB IKK-beta IKK2/IKK1 IKKB_HUMAN Inhibitor of nuclear factor kappa B kinase beta subunit Nuclear factor NF-kappa-B inhibitor kinase beta
Type:
Serine/threonine-protein kinase
Mol. Mass.:
86554.39
Organism:
Homo sapiens (Human)
Description:
GST-tagged IKK-2 was expressed in High Five cells and purified.
Residue:
756
  
Inhibitor
Name:
BDBM312754
Synonyms:
5-[(1R)-1-hydroxyethyl]-1- [3-[2-[(3R)-3-hydroxy-1-meth- yl-2-oxo-pyrrolidin-3-yl] ethynyl]phenyl]indazole-3- carboxamide | US9605005, Example 43
Type:
Small organic molecule
Emp. Form.:
C23H22N4O4
Mol. Mass.:
418.4452
SMILES:
C[C@@H](O)c1ccc2n(nc(C(N)=O)c2c1)-c1cccc(c1)C#C[C@]1(O)CCN(C)C1=O
: