Target
Inhibitor of nuclear factor kappa-B kinase subunit beta
Ligand
BDBM312819
Substrate
Meas. Tech.
NIK Enzyme Inhibition Assay
Ki
9.58±n/a nM
Citation
 Blaquiere, NCastanedo, GFeng, JAHu, BStaben, SYuen, PWu, GBurch, J Alkynyl alcohols and methods of use US Patent  US9605005 Publication Date 3/28/2017 
Target
Name:
Inhibitor of nuclear factor kappa-B kinase subunit beta
Synonyms:
I-kappa-B Kinase 2 (IKK-beta) I-kappa-B-kinase beta IKBKB IKK-beta IKK2/IKK1 IKKB_HUMAN Inhibitor of nuclear factor kappa B kinase beta subunit Nuclear factor NF-kappa-B inhibitor kinase beta
Type:
Serine/threonine-protein kinase
Mol. Mass.:
86554.39
Organism:
Homo sapiens (Human)
Description:
GST-tagged IKK-2 was expressed in High Five cells and purified.
Residue:
756
  
Inhibitor
Name:
BDBM312819
Synonyms:
(4R)-1-[3-[2-[(3R)-3-hydroxy- 1-methyl-2-oxo-pyrrolidin- 3-yl]ethynyl]phenyl]-4- methyl-5,6-dihydro-4H-cyclo- penta[c]pyrazole-3-carbox- amide | US9605005, Example 109
Type:
Small organic molecule
Emp. Form.:
C21H22N4O3
Mol. Mass.:
378.4244
SMILES:
C[C@@H]1CCc2c1c(nn2-c1cccc(c1)C#C[C@]1(O)CCN(C)C1=O)C(N)=O
: