Target
Caspase-7
Ligand
BDBM10219
Substrate
Caspase-3 (7) Fluorogenic Substrate
Meas. Tech.
Enzyme Inhibition Assay
IC50
>200000±n/a nM
Citation
 Fattorusso, RJung, DCrowell, KJForino, MPellecchia, M Discovery of a novel class of reversible non-peptide caspase inhibitors via a structure-based approach. J Med Chem 48:1649-56 (2005)  
Target
Name:
Caspase-7
Synonyms:
Apoptotic protease Mch-3 CASP7 CMH-1 MCH3 | caspase 7, apoptosis-related cysteine peptidase
Type:
Enzyme
Mol. Mass.:
34273.91
Organism:
Homo sapiens (Human)
Description:
P55210
Residue:
303
  
Inhibitor
Name:
BDBM10219
Synonyms:
BI-9B11 [2-(2,3-dihydro-1,4-benzodioxin-2-yl)-1,3-thiazol-4-yl](thiophen-2-ylsulfanyl)methanone
Type:
Small organic molecule
Emp. Form.:
C16H11NO3S3
Mol. Mass.:
361.458
SMILES:
O=C(Sc1cccs1)c1csc(n1)C1COc2ccccc2O1
:
Substrate
Name:
Caspase-3 (7) Fluorogenic Substrate
Synonyms:
Type:
Mol. Mass.:
1477.75
Organism:
Description:
AFC = 7-Amino-4-trifluoromethylcoumarin
Residue:
16
ACASPGLVALASPAFC