Target
Caspase-8
Ligand
BDBM10219
Substrate
Caspase-8 Fluorogenic Substrate
Meas. Tech.
Enzyme Inhibition Assay
IC50
62000±n/a nM
Citation
 Fattorusso, RJung, DCrowell, KJForino, MPellecchia, M Discovery of a novel class of reversible non-peptide caspase inhibitors via a structure-based approach. J Med Chem 48:1649-56 (2005)  
Target
Name:
Caspase-8
Synonyms:
Apoptotic cysteine protease CAP4 CASP8 Caspase Caspase-8 subunit p18 FADD-like ICE ICE-like apoptotic protease 5 MCH5 | MORT1-associated CED-3 homolog
Type:
Enzyme
Mol. Mass.:
55373.89
Organism:
Homo sapiens (Human)
Description:
Q14790
Residue:
479
  
Inhibitor
Name:
BDBM10219
Synonyms:
BI-9B11 [2-(2,3-dihydro-1,4-benzodioxin-2-yl)-1,3-thiazol-4-yl](thiophen-2-ylsulfanyl)methanone
Type:
Small organic molecule
Emp. Form.:
C16H11NO3S3
Mol. Mass.:
361.458
SMILES:
O=C(Sc1cccs1)c1csc(n1)C1COc2ccccc2O1
:
Substrate
Name:
Caspase-8 Fluorogenic Substrate
Synonyms:
Type:
Mol. Mass.:
1689.47
Organism:
Description:
AFC=7-Amino-4-trifluoromethylcoumarin
Residue:
16
ACILEGLTHRASPAFC