Target
Caspase-8
Ligand
BDBM10222
Substrate
Caspase-8 Fluorogenic Substrate
Meas. Tech.
Enzyme Inhibition Assay
IC50
>200000±n/a nM
Citation
 Fattorusso, RJung, DCrowell, KJForino, MPellecchia, M Discovery of a novel class of reversible non-peptide caspase inhibitors via a structure-based approach. J Med Chem 48:1649-56 (2005)  
Target
Name:
Caspase-8
Synonyms:
Apoptotic cysteine protease CAP4 CASP8 Caspase Caspase-8 subunit p18 FADD-like ICE ICE-like apoptotic protease 5 MCH5 | MORT1-associated CED-3 homolog
Type:
Enzyme
Mol. Mass.:
55373.89
Organism:
Homo sapiens (Human)
Description:
Q14790
Residue:
479
  
Inhibitor
Name:
BDBM10222
Synonyms:
4-chlorophenyl 2-(2,3-dihydro-1,4-benzodioxin-2-yl)-1,3-thiazole-4-carboxylate Burnham Institute Compound 8
Type:
Small organic molecule
Emp. Form.:
C18H12ClNO4S
Mol. Mass.:
373.81
SMILES:
Clc1ccc(OC(=O)c2csc(n2)C2COc3ccccc3O2)cc1
:
Substrate
Name:
Caspase-8 Fluorogenic Substrate
Synonyms:
Type:
Mol. Mass.:
1689.47
Organism:
Description:
AFC=7-Amino-4-trifluoromethylcoumarin
Residue:
16
ACILEGLTHRASPAFC