Target
Potassium voltage-gated channel subfamily H member 2
Ligand
BDBM223358
Substrate
Meas. Tech.
hERG Patch Clamp Assay
IC50
200±n/a nM
Citation
 Brodney, MABeck, EMButler, CRZhang, LO Neill, BTBarreiro, GLaChapelle, EARogers, BN 2-amino-6-methyl-4,4a,5,6-tetrahydropyrano[3,4-d][1,3]thiazin-8a(8H)-yl-1,3-thiazol-4-yl amides US Patent  US9605007 Publication Date 3/28/2017 
Target
Name:
Potassium voltage-gated channel subfamily H member 2
Synonyms:
1,3-beta-glucan synthase component GLS2 ERG Eag-related protein 1 Ether-a-go-go-related gene (HERG) Ether-a-go-go-related gene potassium channel 1 Ether-a-go-go-related gene potassium channel 1 (hERG1) Ether-a-go-go-related protein 1 H-ERG KCNH2 Potassium voltage-gated channel subfamily H member 2 (hERG) Voltage-gated potassium channel subunit Kv11.1 hERG Potassium Channel 1 | putative potassium channel subunit
Type:
Multi-pass membrane protein
Mol. Mass.:
126672.65
Organism:
Homo sapiens (Human)
Description:
Q12809
Residue:
1159
  
Inhibitor
Name:
BDBM223358
Synonyms:
US9315520, Comparator 7 US9744173, Comparator 7
Type:
Small organic molecule
Emp. Form.:
C20H20ClFN4O2S
Mol. Mass.:
434.915
SMILES:
[H][C@]12CSC(N)=N[C@]1(CO[C@@H](C)C2)c1cc(NC(=O)c2ccc(Cl)cn2)ccc1F
: