Target
Caspase-6
Ligand
BDBM10247
Substrate
Caspase Substrate
Meas. Tech.
Caspase Inhibition Assay
IC50
474±n/a nM
Citation
 Chen, YHZhang, YHZhang, HJLiu, DZGu, MLi, JYWu, FZhu, XZLi, JNan, FJ Design, synthesis, and biological evaluation of isoquinoline-1,3,4-trione derivatives as potent caspase-3 inhibitors. J Med Chem 49:1613-23 (2006)  
Target
Name:
Caspase-6
Synonyms:
Apoptotic protease Mch-2 CASP6 Caspase | MCH2
Type:
Enzyme
Mol. Mass.:
33312.62
Organism:
Homo sapiens (Human)
Description:
P55212
Residue:
293
  
Inhibitor
Name:
BDBM10247
Synonyms:
1,2,3,4-tetrahydroisoquinoline-1,3,4-trione hsp90_153
Type:
Small organic molecule
Emp. Form.:
C9H5NO3
Mol. Mass.:
175.1409
SMILES:
O=C1NC(=O)c2ccccc2C1=O
:
Substrate
Name:
Caspase Substrate
Synonyms:
Type:
Mol. Mass.:
358.43
Organism:
Description:
Residue:
3
NA