Target
Baculoviral IAP repeat-containing protein 2/E3 ubiquitin-protein ligase XIAP
Ligand
BDBM312990
Substrate
Meas. Tech.
Homogeneous Time Resolved Fluorescence (HTRF) Assay
IC50
0.400±n/a nM
Citation
 Borzilleri, RMZhang, YMiller, MFraley, A Macrocyclic compounds for inhibition of inhibitors of apoptosis US Patent  US9605022 Publication Date 3/28/2017 
Target
Name:
Baculoviral IAP repeat-containing protein 2/E3 ubiquitin-protein ligase XIAP
Synonyms:
XIAP BIR2-3 | XIAP-BIR2
Type:
Protein
Mol. Mass.:
Description:
Components:
This complex has 2 components.
Component 1
Name:
E3 ubiquitin-protein ligase XIAP
Synonyms:
API3 E3 ubiquitin-protein ligase XIAP Inhibitor of apoptosis protein 3 X-linked inhibitor of apoptosis XIAP | XIAP_HUMAN
Type:
Protein
Mol. Mass.:
56685.27
Organism:
Homo sapiens (Human)
Description:
P98170
Residue:
497
  
Component 2
Name:
Baculoviral IAP repeat-containing protein 2
Synonyms:
API1 BIRC2_HUMAN Cellular inhibitor of apoptosis 1 MIHB | RNF48
Type:
Protein
Mol. Mass.:
69900.47
Organism:
Homo sapiens (Human)
Description:
Q13490
Residue:
618
  
Inhibitor
Name:
BDBM312990
Synonyms:
US9605022, Example 19
Type:
Small organic molecule
Emp. Form.:
C81H96N18O14
Mol. Mass.:
1545.7411
SMILES:
CN[C@@H](C)C(=O)N[C@H](C(=O)N1CC[C@@H]2[C@H]1C(=O)N[C@@H](Cc1ccc3ccccc3c1)C(=O)N[C@H](Cc1ccc(OCc3cn(nn3)[C@@H]3CCN([C@@H]3C(=O)N[C@@H](Cc3ccc4ccccc4c3)C(=O)N[C@@H](Cc3ccc(OCc4cn2nn4)cc3)c2nc(=O)o[nH]2)C(=O)[C@@H](NC(=O)[C@H](C)NC)C(C)(C)C)cc1)C(O)=O)C(C)(C)C
: