Target
Tyrosine-protein kinase receptor UFO
Ligand
BDBM313144
Substrate
Meas. Tech.
PHOSPHO-AKT IN-CELL WESTERN ASSAY
IC50
<1000±n/a nM
Citation
 Goff, DZhang, JSylvain, CSingh, RHolland, SYu, JHeckrodt, TJDing, P Substituted triazoles useful as Axl inhibitors US Patent  US10166216 Publication Date 1/1/2019 
Target
Name:
Tyrosine-protein kinase receptor UFO
Synonyms:
AXL TEL/AXL UFO | UFO_HUMAN
Type:
Enzyme
Mol. Mass.:
98316.97
Organism:
Homo sapiens (Human)
Description:
P30530
Residue:
894
  
Inhibitor
Name:
BDBM313144
Synonyms:
1-(6,7-dimethoxyquinazolin-4-yl)-N3-(4-(4-(cyclopentyl)piperazin-1-ylcarbonyl)phenyl)-1H-1,2,4-triazole-3,5-diamine | US10166216, Compound 206
Type:
Small organic molecule
Emp. Form.:
C28H33N9O3
Mol. Mass.:
543.6201
SMILES:
COc1cc2ncnc(-n3nc(Nc4ccc(cc4)C(=O)N4CCN(CC4)C4CCCC4)nc3N)c2cc1OC
: