Target
Caspase-3
Ligand
BDBM10301
Substrate
Caspase Fluorogenic Substrate
Meas. Tech.
Caspase Inhibition Assay
pH
7.5±n/a
Temperature
303.15±n/a K
IC50
15000±n/a nM
Citation
 Lee, DLong, SAMurray, JHAdams, JLNuttall, MENadeau, DPKikly, KWinkler, JDSung, CMRyan, MDLevy, MAKeller, PMDeWolf, WE Potent and selective nonpeptide inhibitors of caspases 3 and 7. J Med Chem 44:2015-26 (2001)  
Target
Name:
Caspase-3
Synonyms:
Apopain CASP3 CPP-32 Caspase 3 Caspase-3 subunit p17 SCA-1 Yama protein | caspase-3 preproprotein
Type:
Hydrolase; heterotetramer of two heterodimers
Mol. Mass.:
31607.55
Organism:
Homo sapiens (Human)
Description:
Residue:
277
  
Inhibitor
Name:
BDBM10301
Synonyms:
CHEMBL64582 methyl 1-methyl-2,3-dioxo-2,3-dihydro-1H-indole-5-carboxylate
Type:
Small organic molecule
Emp. Form.:
C11H9NO4
Mol. Mass.:
219.1935
SMILES:
COC(=O)c1ccc2N(C)C(=O)C(=O)c2c1
:
Substrate
Name:
Caspase Fluorogenic Substrate
Synonyms:
Ac-DEVD-AMC | Caspase Fluorogenic Substrate
Type:
Peptide
Mol. Mass.:
1461.77
Organism:
Description:
AMC=7-Amino-4-methylcoumarin
Residue:
16
ACASPGLVALASPAMC