Target
Caspase-2
Ligand
BDBM10305
Substrate
Caspase-2 Fluorogenic Substrate
Meas. Tech.
Caspase Inhibition Assay
Ki
>25000±n/a nM
Citation
 Lee, DLong, SAMurray, JHAdams, JLNuttall, MENadeau, DPKikly, KWinkler, JDSung, CMRyan, MDLevy, MAKeller, PMDeWolf, WE Potent and selective nonpeptide inhibitors of caspases 3 and 7. J Med Chem 44:2015-26 (2001)  
Target
Name:
Caspase-2
Synonyms:
CASP-2 CASP2_HUMAN Caspase-2 subunit p13 ICH-1 protease ICH1 NEDD2 | Neural precursor cell expressed developmentally down-regulated protein 2
Type:
Enzyme
Mol. Mass.:
50688.29
Organism:
Homo sapiens (Human)
Description:
P42575
Residue:
452
  
Inhibitor
Name:
BDBM10305
Synonyms:
(S)-5-[1-(2-Methoxymethyl)pyrrolidinylsulfonyl]isatin CHEMBL60190 | Isatin Sulfonamide 16
Type:
Small organic molecule
Emp. Form.:
C14H16N2O5S
Mol. Mass.:
324.352
SMILES:
COC[C@@H]1CCCN1S(=O)(=O)c1ccc2NC(=O)C(=O)c2c1
:
Substrate
Name:
Caspase-2 Fluorogenic Substrate
Synonyms:
Ac-VDVAD-AMC
Type:
Mol. Mass.:
1830.24
Organism:
Description:
AMC=7-Amino-4-methylcoumarin
Residue:
20