Target
Caspase-4
Ligand
BDBM10316
Substrate
Caspase-4 Fluorogenic Substrate
Meas. Tech.
Caspase Inhibition Assay
Ki
>50000±n/a nM
Citation
 Lee, DLong, SAMurray, JHAdams, JLNuttall, MENadeau, DPKikly, KWinkler, JDSung, CMRyan, MDLevy, MAKeller, PMDeWolf, WE Potent and selective nonpeptide inhibitors of caspases 3 and 7. J Med Chem 44:2015-26 (2001)  
Target
Name:
Caspase-4
Synonyms:
CASP-4 CASP4_HUMAN Caspase-4 subunit 1 ICE(rel)-II ICH2 | TX protease
Type:
Enzyme
Mol. Mass.:
43257.75
Organism:
Homo sapiens (Human)
Description:
P49662
Residue:
377
  
Inhibitor
Name:
BDBM10316
Synonyms:
(R)-5-{1-[2-(Anilinomethyl)pyrrolidinyl]sulfonyl}isatin Isatin Sulfonamide 27
Type:
Small organic molecule
Emp. Form.:
C19H19N3O4S
Mol. Mass.:
385.437
SMILES:
O=C1Nc2ccc(cc2C1=O)S(=O)(=O)N1CCC[C@@H]1CNc1ccccc1
:
Substrate
Name:
Caspase-4 Fluorogenic Substrate
Synonyms:
Ac-LEED-AMC
Type:
Mol. Mass.:
1334.60
Organism:
Description:
AMC=7-Amino-4-methylcoumarin
Residue:
14
ACLEGLGLASPAMC