Target
Caspase-6
Ligand
BDBM10305
Substrate
Caspase Fluorogenic Substrate
Meas. Tech.
Caspase Inhibition Assay
Ki
>25000±n/a nM
Citation
 Lee, DLong, SAMurray, JHAdams, JLNuttall, MENadeau, DPKikly, KWinkler, JDSung, CMRyan, MDLevy, MAKeller, PMDeWolf, WE Potent and selective nonpeptide inhibitors of caspases 3 and 7. J Med Chem 44:2015-26 (2001)  
Target
Name:
Caspase-6
Synonyms:
Apoptotic protease Mch-2 CASP6 Caspase | MCH2
Type:
Enzyme
Mol. Mass.:
33312.62
Organism:
Homo sapiens (Human)
Description:
P55212
Residue:
293
  
Inhibitor
Name:
BDBM10305
Synonyms:
(S)-5-[1-(2-Methoxymethyl)pyrrolidinylsulfonyl]isatin CHEMBL60190 | Isatin Sulfonamide 16
Type:
Small organic molecule
Emp. Form.:
C14H16N2O5S
Mol. Mass.:
324.352
SMILES:
COC[C@@H]1CCCN1S(=O)(=O)c1ccc2NC(=O)C(=O)c2c1
:
Substrate
Name:
Caspase Fluorogenic Substrate
Synonyms:
Ac-DEVD-AMC | Caspase Fluorogenic Substrate
Type:
Peptide
Mol. Mass.:
1461.77
Organism:
Description:
AMC=7-Amino-4-methylcoumarin
Residue:
16
ACASPGLVALASPAMC