Target
Caspase-7
Ligand
BDBM10315
Substrate
Caspase Fluorogenic Substrate
Meas. Tech.
Caspase Inhibition Assay
Ki
47±n/a nM
Citation
 Lee, DLong, SAMurray, JHAdams, JLNuttall, MENadeau, DPKikly, KWinkler, JDSung, CMRyan, MDLevy, MAKeller, PMDeWolf, WE Potent and selective nonpeptide inhibitors of caspases 3 and 7. J Med Chem 44:2015-26 (2001)  
Target
Name:
Caspase-7
Synonyms:
Apoptotic protease Mch-3 CASP7 CMH-1 MCH3 | caspase 7, apoptosis-related cysteine peptidase
Type:
Enzyme
Mol. Mass.:
34273.91
Organism:
Homo sapiens (Human)
Description:
P55210
Residue:
303
  
Inhibitor
Name:
BDBM10315
Synonyms:
(S)-5-{1-[2-(Anilinomethyl)pyrrolidinyl]sulfonyl}isatin Isatin Sulfonamide 26
Type:
Small organic molecule
Emp. Form.:
C19H19N3O4S
Mol. Mass.:
385.437
SMILES:
O=C1Nc2ccc(cc2C1=O)S(=O)(=O)N1CCC[C@H]1CNc1ccccc1
:
Substrate
Name:
Caspase Fluorogenic Substrate
Synonyms:
Ac-DEVD-AMC | Caspase Fluorogenic Substrate
Type:
Peptide
Mol. Mass.:
1461.77
Organism:
Description:
AMC=7-Amino-4-methylcoumarin
Residue:
16
ACASPGLVALASPAMC