Target
Caspase-9
Ligand
BDBM10318
Substrate
Caspase-9 Fluorogenic Substrate
Meas. Tech.
Caspase Inhibition Assay
Ki
1200±n/a nM
Citation
 Lee, DLong, SAMurray, JHAdams, JLNuttall, MENadeau, DPKikly, KWinkler, JDSung, CMRyan, MDLevy, MAKeller, PMDeWolf, WE Potent and selective nonpeptide inhibitors of caspases 3 and 7. J Med Chem 44:2015-26 (2001)  
Target
Name:
Caspase-9
Synonyms:
Apoptotic protease-activating factor 1/Caspase-3/Caspase-9/Cytochrome c CASP-9 CASP9_HUMAN ICE-like apoptotic protease 6 caspase-9 isoform alpha preproprotein
Type:
Enzyme
Mol. Mass.:
46277.29
Organism:
Homo sapiens (Human)
Description:
Residue:
416
  
Inhibitor
Name:
BDBM10318
Synonyms:
(S)-5-{1-[2-(Phenoxymethyl)pyrrolidinyl]sulfonyl}isatin CHEMBL62993 Pyrrolidine Isatin Analogue 10
Type:
Small organic molecule
Emp. Form.:
C19H18N2O5S
Mol. Mass.:
386.422
SMILES:
O=C1Nc2ccc(cc2C1=O)S(=O)(=O)N1CCC[C@H]1COc1ccccc1
:
Substrate
Name:
Caspase-9 Fluorogenic Substrate
Synonyms:
Ac-LEHD-AFC
Type:
Mol. Mass.:
1518.25
Organism:
Description:
AFC=7-Amino-4-trifluoromethylcoumarin
Residue:
15
ACLEGLHISASPAFC