Target
High affinity nerve growth factor receptor
Ligand
BDBM164944
Substrate
Meas. Tech.
In Vitro TrkA Activity
IC50
0.200±n/a nM
Citation
 Kane, Jr., JLMatthews, GMetz, MKothe, MLiu, JScholte, A Tropomyosin-related kinase (Trk) inhibitors US Patent  US10166239 Publication Date 1/1/2019 
Target
Name:
High affinity nerve growth factor receptor
Synonyms:
2.7.10.1 NTRK1 NTRK1_HUMAN Neurotrophic tyrosine kinase receptor type 1 Synonyms=MTC TRK1-transforming tyrosine kinase protein TRKA GN Tropomyosin alpha-3 chain/High affinity nerve growth factor receptor Tropomyosin-related kinase A (TrkA) Tyrosine kinase receptor (Trk) Tyrosine kinase receptor A (Trk A) Tyrosine kinase receptor A (TrkA) p140-TrkA
Type:
Mol. Mass.:
87498.18
Organism:
Homo sapiens (Human)
Description:
P04629
Residue:
796
  
Inhibitor
Name:
BDBM164944
Synonyms:
US10166239, Ex. 3-40-4 US9067914, Ex. 3-40-4
Type:
Small organic molecule
Emp. Form.:
C27H25F3N6O2
Mol. Mass.:
522.5216
SMILES:
COc1cc(Cn2c(N)nc3cc(cnc23)-c2cnn(C)c2)ccc1OCc1ccc(CC(F)(F)F)cc1
: