Target
Sphingosine-1-phosphate lyase 1
Ligand
BDBM313310
Substrate
Meas. Tech.
hS1P1 ERK Phosphorylation (S1P1 pERK)
EC50
<10±n/a nM
Citation
 Dyckman, AJDhar, TGXiao, HGilmore, JLYang, MGXiao, ZMarcoux, D Substituted bicyclic compounds US Patent  US10166249 Publication Date 1/1/2019 
Target
Name:
Sphingosine-1-phosphate lyase 1
Synonyms:
KIAA1252 SGPL1 SP-lyase 1 Sphingosine-1-phosphate aldolase | hSPL
Type:
PROTEIN
Mol. Mass.:
63546.76
Organism:
Homo sapiens (Human)
Description:
ChEMBL_108363
Residue:
568
  
Inhibitor
Name:
BDBM313310
Synonyms:
US10166249, Example 544 | US10166249, Example 545
Type:
Small organic molecule
Emp. Form.:
C25H34NO6P
Mol. Mass.:
475.5143
SMILES:
COc1cccc(OCCC2CCc3cc(ccc3C2)[C@H]2CC[C@](N)(COP(O)(O)=O)C2)c1
: