Target
Sphingosine-1-phosphate lyase 1
Ligand
BDBM65346
Substrate
Meas. Tech.
Receptor [35S] GTPgammaS Binding Assays: (S1P1 GTPgammaS/S1P3 GTPgammaS)
EC50
<10±n/a nM
Citation
 Dyckman, AJDhar, TGXiao, HGilmore, JLYang, MGXiao, ZMarcoux, D Substituted bicyclic compounds US Patent  US10166249 Publication Date 1/1/2019 
Target
Name:
Sphingosine-1-phosphate lyase 1
Synonyms:
KIAA1252 SGPL1 SP-lyase 1 Sphingosine-1-phosphate aldolase | hSPL
Type:
PROTEIN
Mol. Mass.:
63546.76
Organism:
Homo sapiens (Human)
Description:
ChEMBL_108363
Residue:
568
  
Inhibitor
Name:
BDBM65346
Synonyms:
US10166249, Example 654 | US9522888, 654
Type:
Emp. Form.:
C22H34NO4P
Mol. Mass.:
407.4834
SMILES:
CCC\C=C\C[C@H]1CCc2cc(ccc2C1)[C@H]1CC[C@](N)(COP(O)(O)=O)C1
: