Target
Epidermal growth factor receptor [1-745,751-1210]
Ligand
BDBM313221
Substrate
Meas. Tech.
EGFR in vitro assay
Kd
26.0±n/a nM
Citation
 Zhang, D Substituted pyrimidines useful as EGFR-T790M kinase inhibitors US Patent  US10167264 Publication Date 1/1/2019 
Target
Name:
Epidermal growth factor receptor [1-745,751-1210]
Synonyms:
EGFR EGFR (del 746-750) ERBB Epidermal growth factor receptor (EGFR)(d746-750) | HER1
Type:
Enzyme Catalytic Domain
Mol. Mass.:
133681.95
Organism:
Homo sapiens (Human)
Description:
P00533[1-745,751-1210]
Residue:
1205
  
Inhibitor
Name:
BDBM313221
Synonyms:
N-[3-[[2-[4-(4-acetylpiperazin-1-yl)anilino]-5-(trifluoromethyl)pyrimidin-4-yl]amino]phenyl] prop-2-enamide | US10167264, Compound 8
Type:
Small organic molecule
Emp. Form.:
C26H26F3N7O2
Mol. Mass.:
525.5255
SMILES:
CC(=O)N1CCN(CC1)c1ccc(Nc2ncc(c(Nc3cccc(NC(=O)C=C)c3)n2)C(F)(F)F)cc1
: