Target
Caspase-3
Ligand
BDBM10338
Substrate
Caspase Fluorogenic Substrate
Meas. Tech.
Caspase Inhibition Assay
pH
7.4±n/a
Temperature
310.15±n/a K
IC50
286.7±24.7 nM
Citation
 Chu, WZhang, JZeng, CRothfuss, JTu, ZChu, YReichert, DEWelch, MJMach, RH N-benzylisatin sulfonamide analogues as potent caspase-3 inhibitors: synthesis, in vitro activity, and molecular modeling studies. J Med Chem 48:7637-47 (2005)  
Target
Name:
Caspase-3
Synonyms:
Apopain CASP3 CPP-32 Caspase 3 Caspase-3 subunit p17 SCA-1 Yama protein | caspase-3 preproprotein
Type:
Hydrolase; heterotetramer of two heterodimers
Mol. Mass.:
31607.55
Organism:
Homo sapiens (Human)
Description:
Residue:
277
  
Inhibitor
Name:
BDBM10338
Synonyms:
(S)-5-(2-Phenoxymethyl-azetidine-1-sulfonyl)-1H-indole-2,3-dione Azetidine Isatin Analogue 17
Type:
Small organic molecule
Emp. Form.:
C18H16N2O5S
Mol. Mass.:
372.395
SMILES:
O=C1Nc2ccc(cc2C1=O)S(=O)(=O)N1CC[C@H]1COc1ccccc1
:
Substrate
Name:
Caspase Fluorogenic Substrate
Synonyms:
Ac-DEVD-AMC | Caspase Fluorogenic Substrate
Type:
Peptide
Mol. Mass.:
1461.77
Organism:
Description:
AMC=7-Amino-4-methylcoumarin
Residue:
16
ACASPGLVALASPAMC