Target
Caspase-6
Ligand
BDBM10318
Substrate
Caspase-6 Fluorogenic Substrate
Meas. Tech.
Caspase Inhibition Assay
IC50
>5000±n/a nM
Citation
 Chu, WZhang, JZeng, CRothfuss, JTu, ZChu, YReichert, DEWelch, MJMach, RH N-benzylisatin sulfonamide analogues as potent caspase-3 inhibitors: synthesis, in vitro activity, and molecular modeling studies. J Med Chem 48:7637-47 (2005)  
Target
Name:
Caspase-6
Synonyms:
Apoptotic protease Mch-2 CASP6 Caspase | MCH2
Type:
Enzyme
Mol. Mass.:
33312.62
Organism:
Homo sapiens (Human)
Description:
P55212
Residue:
293
  
Inhibitor
Name:
BDBM10318
Synonyms:
(S)-5-{1-[2-(Phenoxymethyl)pyrrolidinyl]sulfonyl}isatin CHEMBL62993 Pyrrolidine Isatin Analogue 10
Type:
Small organic molecule
Emp. Form.:
C19H18N2O5S
Mol. Mass.:
386.422
SMILES:
O=C1Nc2ccc(cc2C1=O)S(=O)(=O)N1CCC[C@H]1COc1ccccc1
:
Substrate
Name:
Caspase-6 Fluorogenic Substrate
Synonyms:
Ac-VEID-AMC
Type:
Mol. Mass.:
1560.92
Organism:
Description:
AMC=7-Amino-4-methylcoumarin
Residue:
16
ACVALGLILEASPAMC