Target
Lysosomal acid glucosylceramidase
Ligand
BDBM50196521
Substrate
Meas. Tech.
High Throughput Screening (HTS) by Fluorescence Polarization (pH = 7.0)
IC50
9.40±1.4 nM
Citation
 Krainc, DSilverman, RBZheng, J Substituted quinazoline compounds and uses thereof for modulating glucocerebrosidase activity US Patent  US10167270 Publication Date 1/1/2019 
Target
Name:
Lysosomal acid glucosylceramidase
Synonyms:
Acid beta-glucosidase Beta-glucocerebrosidase D-glucosyl-N-acylsphingosine glucohydrolase GBA1 GC GLUC Glucosylceramidase (GBA) Glucosylceramidase precursor (Beta-glucocerebrosidase) (Acid beta-glucosidase) (D-glucosyl-N-acylsphingosine glucohydrolase) (Alglucerase) (Imiglucerase) beta-glucocerebrosidase (GCase)
Type:
Enzyme
Mol. Mass.:
59724.64
Organism:
Homo sapiens (Human)
Description:
The beta-Glu activity was measured with commercially available beta-glucocerebrosidase (Ceredase) as the enzyme source.
Residue:
536
  
Inhibitor
Name:
BDBM50196521
Synonyms:
CHEMBL3939100 US10501435, Compound 11d
Type:
Small organic molecule
Emp. Form.:
C23H19N3
Mol. Mass.:
337.4171
SMILES:
C1C(Cc2ccccc12)Nc1nc(nc2ccccc12)-c1ccccc1
: