Target
Prokineticin receptor 1
Ligand
BDBM250545
Substrate
Meas. Tech.
BIOLOGICAL ASSAY
IC50
1500±n/a nM
Citation
 Carroll, CGoldby, ATeall, M Sulfonyl piperidine derivatives and their use for treating prokineticin mediated diseases US Patent  US10167273 Publication Date 1/1/2019 
Target
Name:
Prokineticin receptor 1
Synonyms:
G-protein coupled receptor 73 GPR73 PK-R1 PKR1_HUMAN | PROKR1
Type:
enzyme
Mol. Mass.:
44779.92
Organism:
Homo sapiens (Human)
Description:
Q8TCW9
Residue:
393
  
Inhibitor
Name:
BDBM250545
Synonyms:
US10167273, Example 24 US11512066, Example 24 | US9475795, 24
Type:
Small organic molecule
Emp. Form.:
C18H24ClN3O3S
Mol. Mass.:
397.919
SMILES:
CC1CC(CCN1S(=O)(=O)c1c(C)nn(C)c1C)Oc1ccc(Cl)cc1
: