Target
Prokineticin receptor 1
Ligand
BDBM250562
Substrate
Meas. Tech.
BIOLOGICAL ASSAY
IC50
5900±n/a nM
Citation
 Carroll, CGoldby, ATeall, M Sulfonyl piperidine derivatives and their use for treating prokineticin mediated diseases US Patent  US10167273 Publication Date 1/1/2019 
Target
Name:
Prokineticin receptor 1
Synonyms:
G-protein coupled receptor 73 GPR73 PK-R1 PKR1_HUMAN | PROKR1
Type:
enzyme
Mol. Mass.:
44779.92
Organism:
Homo sapiens (Human)
Description:
Q8TCW9
Residue:
393
  
Inhibitor
Name:
BDBM250562
Synonyms:
US10167273, Example 41 US11512066, Example 41 | US9475795, 41
Type:
Small organic molecule
Emp. Form.:
C17H22FN3O4S
Mol. Mass.:
383.438
SMILES:
COc1ccc(OC2CCN(CC2)S(=O)(=O)c2c(C)n[nH]c2C)cc1F
: