Target
Prokineticin receptor 1
Ligand
BDBM250612
Substrate
Meas. Tech.
BIOLOGICAL ASSAY
IC50
140±n/a nM
Citation
 Carroll, CGoldby, ATeall, M Sulfonyl piperidine derivatives and their use for treating prokineticin mediated diseases US Patent  US10167273 Publication Date 1/1/2019 
Target
Name:
Prokineticin receptor 1
Synonyms:
G-protein coupled receptor 73 GPR73 PK-R1 PKR1_HUMAN | PROKR1
Type:
enzyme
Mol. Mass.:
44779.92
Organism:
Homo sapiens (Human)
Description:
Q8TCW9
Residue:
393
  
Inhibitor
Name:
BDBM250612
Synonyms:
US10167273, Example 91 US11512066, Example 91 | US9475795, 91
Type:
Small organic molecule
Emp. Form.:
C19H25ClFN3O3S
Mol. Mass.:
429.937
SMILES:
COc1cc(Cl)ccc1CC1(F)CCN(CC1)S(=O)(=O)c1c(C)nn(C)c1C
: