Target
Prokineticin receptor 1
Ligand
BDBM250629
Substrate
Meas. Tech.
BIOLOGICAL ASSAY
IC50
1640±n/a nM
Citation
 Carroll, CGoldby, ATeall, M Sulfonyl piperidine derivatives and their use for treating prokineticin mediated diseases US Patent  US10167273 Publication Date 1/1/2019 
Target
Name:
Prokineticin receptor 1
Synonyms:
G-protein coupled receptor 73 GPR73 PK-R1 PKR1_HUMAN | PROKR1
Type:
enzyme
Mol. Mass.:
44779.92
Organism:
Homo sapiens (Human)
Description:
Q8TCW9
Residue:
393
  
Inhibitor
Name:
BDBM250629
Synonyms:
US10167273, Example 108 US11512066, Example 108 | US9475795, 108
Type:
Small organic molecule
Emp. Form.:
C17H22ClN3O3S
Mol. Mass.:
383.893
SMILES:
Cc1n[nH]c(C)c1S(=O)(=O)N1CCC(O)(Cc2ccc(Cl)cc2)CC1
: