Target
Metabotropic glutamate receptor 4
Ligand
BDBM182882
Substrate
Meas. Tech.
Ca2+ Mobilization In Vitro Assay
EC50
152±n/a nM
Citation
 Biemans, BGuba, WJaeschke, GRicci, ARueher, DVieira, E Ethynyl derivatives US Patent  US9676732 Publication Date 6/13/2017 
Target
Name:
Metabotropic glutamate receptor 4
Synonyms:
GPRC1D GRM4_HUMAN MGLUR4 Metabotropic glutamate receptor 4 (mGlu4) metabotropic glutamate 4
Type:
Protein
Mol. Mass.:
101899.95
Organism:
Homo sapiens (Human)
Description:
Q14833
Residue:
912
  
Inhibitor
Name:
BDBM182882
Synonyms:
US9676732, 16 3-[2-Chloro-4-(2-phenylethynyl)phenyl]-1H-pyrimido[4,5-d]pyrimidine-2,4-dione
Type:
Small organic molecule
Emp. Form.:
C20H11ClN4O2
Mol. Mass.:
374.78
SMILES:
Clc1cc(ccc1-n1c(=O)[nH]c2ncncc2c1=O)C#Cc1ccccc1
: