Target
Metabotropic glutamate receptor 4
Ligand
BDBM182937
Substrate
Meas. Tech.
Ca2+ Mobilization In Vitro Assay
EC50
86±n/a nM
Citation
 Biemans, BGuba, WJaeschke, GRicci, ARueher, DVieira, E Ethynyl derivatives US Patent  US9676732 Publication Date 6/13/2017 
Target
Name:
Metabotropic glutamate receptor 4
Synonyms:
GPRC1D GRM4_HUMAN MGLUR4 Metabotropic glutamate receptor 4 (mGlu4) metabotropic glutamate 4
Type:
Protein
Mol. Mass.:
101899.95
Organism:
Homo sapiens (Human)
Description:
Q14833
Residue:
912
  
Inhibitor
Name:
BDBM182937
Synonyms:
US9676732, 71 3-[2-Chloro-6-fluoro-4-[2-(3-pyridyl)ethynyl]phenyl]-1-(oxetan-3-yl)quinazoline-2,4-dione
Type:
Small organic molecule
Emp. Form.:
C24H15ClFN3O3
Mol. Mass.:
447.846
SMILES:
Fc1cc(cc(Cl)c1-n1c(=O)n(C2COC2)c2ccccc2c1=O)C#Cc1cccnc1
: